Daftar dan Belajar Sekarang!

Error saat running react native

foto april23
1 Kontribusi 0 Coto
1 bulan yang lalu
FAILURE: Build failed with an exception. * What went wrong: Execution failed for task ':app:installDebug'. > com.android.builder.testing.api.DeviceException: com.android.ddmlib.InstallException: INSTALL_FAILED_USER_RESTRICTED: Install canceled by user * Try: Run with --stacktrace option to get the stack trace. Run with --info or --debug option to get more log output. Run with --scan to get full insights. * Get more help at https://help.gradle.org BUILD FAILED in 11s


Login untuk diksusi di forum sekolah koding